Reaction Details
TargetBroad substrate specificity ATP-binding cassette transporter ABCG2
LigandBDBM50075373
Substrate/Competitorn/a
Meas. Tech.ChEMBL_518478 (CHEMBL938929)
IC50 916±n/a nM
Citation Kühnle, MEgger, MMüller, CMahringer, ABernhardt, GFricker, GKönig, BBuschauer, A Potent and selective inhibitors of breast cancer resistance protein (ABCG2) derived from the p-glycoprotein (ABCB1) modulator tariquidar. J Med Chem52:1190-7 (2009) 
 
Broad substrate specificity ATP-binding cassette transporter ABCG2
Name:Broad substrate specificity ATP-binding cassette transporter ABCG2
Type:Multi-pass membrane protein; monomer or homodimer; disulfide-linked
Mol. Mass.:72329.48
Organism:Homo sapiens (Human)
Description:Q9UNQ0
Residue:655
BDBM50075373
NameBDBM50075373
Synonyms:1N-{4-[2-(6,7-dimethoxy-1,2,3,4-tetrahydro-2-isoquinolinyl)ethyl]phenyl}-4,5-dimethoxy-2-(3-quinolylcarboxamido)benzamide N-(2-((4-(2-(6,7-dimethoxy-3,4-dihydroisoquinolin-2(1H)-yl)ethyl)phenyl)carbamoyl)-4,5-dimethoxyphenyl)quinoline-3-carboxamide US11739089, Compound Tariquidar
TypeSmall organic molecule
Emp. Form.C38H38N4O6
Mol. Mass.646.7315
SMILESCOc1cc2CCN(CCc3ccc(NC(=O)c4cc(OC)c(OC)cc4NC(=O)c4cnc5ccccc5c4)cc3)Cc2cc1OC