Reaction Details
TargetATP-binding cassette sub-family C member 2
LigandBDBM50293015
Substrate/Competitorn/a
Meas. Tech.ChEMBL_518748 (CHEMBL957853)
IC50>20000±n/a nM
Citation Kühnle, MEgger, MMüller, CMahringer, ABernhardt, GFricker, GKönig, BBuschauer, A Potent and selective inhibitors of breast cancer resistance protein (ABCG2) derived from the p-glycoprotein (ABCB1) modulator tariquidar. J Med Chem52:1190-7 (2009) 
 
ATP-binding cassette sub-family C member 2
Name:ATP-binding cassette sub-family C member 2
Type:Protein
Mol. Mass.:174229.45
Organism:Homo sapiens (Human)
Description:Q92887
Residue:1545
BDBM50293015
NameBDBM50293015
Synonyms:CHEMBL502503 | Methyl 4-((4-(2-(6,7-Dimethoxy-1,2,3,4-tetrahydroisoquinolin-2-yl)ethyl)phenyl)amino-carbonyl)-2-(quinoline-2-carbonylamino)benzoate
TypeSmall organic molecule
Emp. Form.C38H36N4O6
Mol. Mass.644.7156
SMILESCOC(=O)c1ccc(cc1NC(=O)c1ccc2ccccc2n1)C(=O)Nc1ccc(CCN2CCc3cc(OC)c(OC)cc3C2)cc1