Reaction Details
TargetATP-binding cassette sub-family C member 2
LigandBDBM50013920
Substrate/Competitorn/a
Meas. Tech.ChEMBL_518748 (CHEMBL957853)
IC50>1000±n/a nM
Citation Kühnle, MEgger, MMüller, CMahringer, ABernhardt, GFricker, GKönig, BBuschauer, A Potent and selective inhibitors of breast cancer resistance protein (ABCG2) derived from the p-glycoprotein (ABCB1) modulator tariquidar. J Med Chem52:1190-7 (2009) 
 
ATP-binding cassette sub-family C member 2
Name:ATP-binding cassette sub-family C member 2
Type:Protein
Mol. Mass.:174229.45
Organism:Homo sapiens (Human)
Description:Q92887
Residue:1545
BDBM50013920
NameBDBM50013920
Synonyms:3-[(R)-{3-[(E)-2-(7-Chloro-quinolin-2-yl)-vinyl]-phenyl}-(2-dimethylcarbamoyl-ethylsulfanyl)-methylsulfanyl]-propionic acid CHEMBL280481 VERLUKAST
TypeSmall organic molecule
Emp. Form.C26H27ClN2O3S2
Mol. Mass.515.087
SMILESCN(C)C(=O)CCS[C@H](SCCC(O)=O)c1cccc(\C=C\c2ccc3ccc(Cl)cc3n2)c1