Reaction Details
TargetPurine nucleoside phosphorylase
LigandBDBM50293063
Substrate/Competitorn/a
Meas. Tech.ChEMBL_519471 (CHEMBL951777)
Ki 0.469±n/a nM
Citation Clinch, KEvans, GBFröhlich, RFFurneaux, RHKelly, PMLegentil, LMurkin, ASLi, LSchramm, VLTyler, PCWoolhouse, AD Third-generation immucillins: syntheses and bioactivities of acyclic immucillin inhibitors of human purine nucleoside phosphorylase. J Med Chem52:1126-43 (2009) 
 
Purine nucleoside phosphorylase
Name:Purine nucleoside phosphorylase
Type:Enzyme
Mol. Mass.:32119.53
Organism:Homo sapiens (Human)
Description:n/a
Residue:289
BDBM50293063
NameBDBM50293063
Synonyms:7-{[(1,3-Dihydroxypropan-2-yl)(2-hydroxyethyl)amino]methyl}-3,5-dihydro-4H-pyrrolo[3,2-d]pyrimidin-4-one | CHEMBL508929
TypeSmall organic molecule
Emp. Form.C12H18N4O4
Mol. Mass.282.2957
SMILESOCCN(Cc1c[nH]c2c1nc[nH]c2=O)C(CO)CO