Reaction Details
TargetPurine nucleoside phosphorylase
LigandBDBM50293079
Substrate/Competitorn/a
Meas. Tech.ChEMBL_519471 (CHEMBL951777)
Ki 96.0±n/a nM
Citation Clinch, KEvans, GBFröhlich, RFFurneaux, RHKelly, PMLegentil, LMurkin, ASLi, LSchramm, VLTyler, PCWoolhouse, AD Third-generation immucillins: syntheses and bioactivities of acyclic immucillin inhibitors of human purine nucleoside phosphorylase. J Med Chem52:1126-43 (2009) 
 
Purine nucleoside phosphorylase
Name:Purine nucleoside phosphorylase
Type:Enzyme
Mol. Mass.:32119.53
Organism:Homo sapiens (Human)
Description:n/a
Residue:289
BDBM50293079
NameBDBM50293079
Synonyms:7-({[(2S)-2,3-Dihydroxypropyl](2-hydroxyethyl)amino}methyl)-3,5-dihydro-4H-pyrrolo[3,2-d]pyrimidin-4-one | CHEMBL490478
TypeSmall organic molecule
Emp. Form.C12H18N4O4
Mol. Mass.282.2957
SMILESOCCN(C[C@@H](O)CO)Cc1c[nH]c2c1nc[nH]c2=O