Reaction Details
TargetPurine nucleoside phosphorylase
LigandBDBM50293082
Substrate/Competitorn/a
Meas. Tech.ChEMBL_519471 (CHEMBL951777)
Ki 190±n/a nM
Citation Clinch, KEvans, GBFröhlich, RFFurneaux, RHKelly, PMLegentil, LMurkin, ASLi, LSchramm, VLTyler, PCWoolhouse, AD Third-generation immucillins: syntheses and bioactivities of acyclic immucillin inhibitors of human purine nucleoside phosphorylase. J Med Chem52:1126-43 (2009) 
 
Purine nucleoside phosphorylase
Name:Purine nucleoside phosphorylase
Type:Enzyme
Mol. Mass.:32119.53
Organism:Homo sapiens (Human)
Description:n/a
Residue:289
BDBM50293082
NameBDBM50293082
Synonyms:7-({[(2S,3S,4R)-2,3,4,5-Tetrahydroxypentyl]amino}methyl)-3,5-dihydro-4H-pyrrolo[3,2-d]pyrimidin-4-one | CHEMBL448606
TypeSmall organic molecule
Emp. Form.C12H18N4O5
Mol. Mass.298.2951
SMILESOC[C@H](O)[C@H](O)[C@H](O)CNCc1c[nH]c2c1nc[nH]c2=O