Reaction Details
TargetPeroxisome proliferator-activated receptor alpha
LigandBDBM50256107
Substrate/Competitorn/a
Meas. Tech.ChEMBL_519278 (CHEMBL947730)
EC50 2±n/a nM
Citation Pingali, HJain, MShah, SPatil, PMakadia, PZaware, PSairam, KVJamili, JGoel, APatel, MPatel, P Modulation of PPAR receptor subtype selectivity of the ligands: aliphatic chain vs aromatic ring as a spacer between pharmacophore and the lipophilic moiety. Bioorg Med Chem Lett18:6471-5 (2008) 
 
Peroxisome proliferator-activated receptor alpha
Name:Peroxisome proliferator-activated receptor alpha
Type:Enzyme
Mol. Mass.:52222.08
Organism:Homo sapiens (Human)
Description:Q07869
Residue:468
BDBM50256107
NameBDBM50256107
Synonyms:4-(5-(5-methyl-2-p-tolyloxazol-4-yl)pentyloxyimino)-4-phenylbutanoic acid | CHEMBL520272
TypeSmall organic molecule
Emp. Form.C26H30N2O4
Mol. Mass.434.5274
SMILESCc1oc(nc1CCCCCO\N=C(\CCC(O)=O)c1ccccc1)-c1ccc(C)cc1