Reaction Details
TargetCarbonic anhydrase 1
LigandBDBM50256511
Substrate/Competitorn/a
Meas. Tech.ChEMBL_519583 (CHEMBL943658)
Ki 5540±n/a nM
Citation Smaine, FZPacchiano, FRami, MBarragan-Montero, VVullo, DScozzafava, AWinum, JYSupuran, CT Carbonic anhydrase inhibitors: 2-substituted-1,3,4-thiadiazole-5-sulfamides act as powerful and selective inhibitors of the mitochondrial isozymes VA and VB over the cytosolic and membrane-associated carbonic anhydrases I, II and IV. Bioorg Med Chem Lett18:6332-5 (2008) 
 
Carbonic anhydrase 1
Name:Carbonic anhydrase 1
Type:Enzyme
Mol. Mass.:28873.37
Organism:Homo sapiens (Human)
Description:P00915
Residue:261
BDBM50256511
NameBDBM50256511
Synonyms:CHEMBL475775 | N-(5-tert-butyl-1,3,4-thiadiazol-2-yl)sulfamide
TypeSmall organic molecule
Emp. Form.C6H12N4O2S2
Mol. Mass.236.315
SMILESCC(C)(C)c1nnc(NS(N)(=O)=O)s1