Reaction Details
TargetCarbonic anhydrase 4
LigandBDBM50256510
Substrate/Competitorn/a
Meas. Tech.ChEMBL_519585 (CHEMBL943660)
Ki 8640±n/a nM
Citation Smaine, FZPacchiano, FRami, MBarragan-Montero, VVullo, DScozzafava, AWinum, JYSupuran, CT Carbonic anhydrase inhibitors: 2-substituted-1,3,4-thiadiazole-5-sulfamides act as powerful and selective inhibitors of the mitochondrial isozymes VA and VB over the cytosolic and membrane-associated carbonic anhydrases I, II and IV. Bioorg Med Chem Lett18:6332-5 (2008) 
 
Carbonic anhydrase 4
Name:Carbonic anhydrase 4
Type:Enzyme
Mol. Mass.:35037.98
Organism:Homo sapiens (Human)
Description:P22748
Residue:312
BDBM50256510
NameBDBM50256510
Synonyms:CHEMBL500977 | N-(5-ethyl-1,3,4-thiadiazol-2-yl)sulfamide
TypeSmall organic molecule
Emp. Form.C4H8N4O2S2
Mol. Mass.208.262
SMILESCCc1nnc(NS(N)(=O)=O)s1