Reaction Details
TargetCarbonic anhydrase 4
LigandBDBM50256512
Substrate/Competitorn/a
Meas. Tech.ChEMBL_519585 (CHEMBL943660)
Ki 4320±n/a nM
Citation Smaine, FZPacchiano, FRami, MBarragan-Montero, VVullo, DScozzafava, AWinum, JYSupuran, CT Carbonic anhydrase inhibitors: 2-substituted-1,3,4-thiadiazole-5-sulfamides act as powerful and selective inhibitors of the mitochondrial isozymes VA and VB over the cytosolic and membrane-associated carbonic anhydrases I, II and IV. Bioorg Med Chem Lett18:6332-5 (2008) 
 
Carbonic anhydrase 4
Name:Carbonic anhydrase 4
Type:Enzyme
Mol. Mass.:35037.98
Organism:Homo sapiens (Human)
Description:P22748
Residue:312
BDBM50256512
NameBDBM50256512
Synonyms:CHEMBL499560 | N-[5-(trifluoromethyl)-1,3,4-thiadiazol-2-yl]sulfamide
TypeSmall organic molecule
Emp. Form.C3H3F3N4O2S2
Mol. Mass.248.207
SMILESNS(=O)(=O)Nc1nnc(s1)C(F)(F)F