Reaction Details
TargetCarbonic anhydrase 1
LigandBDBM50256514
Substrate/Competitorn/a
Meas. Tech.ChEMBL_519583 (CHEMBL943658)
Ki 1890±n/a nM
Citation Smaine, FZPacchiano, FRami, MBarragan-Montero, VVullo, DScozzafava, AWinum, JYSupuran, CT Carbonic anhydrase inhibitors: 2-substituted-1,3,4-thiadiazole-5-sulfamides act as powerful and selective inhibitors of the mitochondrial isozymes VA and VB over the cytosolic and membrane-associated carbonic anhydrases I, II and IV. Bioorg Med Chem Lett18:6332-5 (2008) 
 
Carbonic anhydrase 1
Name:Carbonic anhydrase 1
Type:Enzyme
Mol. Mass.:28873.37
Organism:Homo sapiens (Human)
Description:P00915
Residue:261
BDBM50256514
NameBDBM50256514
Synonyms:CHEMBL451538 | N-[5-(ethylthio)-1,3,4-thiadiazol-2-yl]sulfamide
TypeSmall organic molecule
Emp. Form.C4H8N4O2S3
Mol. Mass.240.327
SMILESCCSc1nnc(NS(N)(=O)=O)s1