Reaction Details
TargetCarbonic anhydrase 2
LigandBDBM50256567
Substrate/Competitorn/a
Meas. Tech.ChEMBL_519584 (CHEMBL943659)
Ki 820±n/a nM
Citation Smaine, FZPacchiano, FRami, MBarragan-Montero, VVullo, DScozzafava, AWinum, JYSupuran, CT Carbonic anhydrase inhibitors: 2-substituted-1,3,4-thiadiazole-5-sulfamides act as powerful and selective inhibitors of the mitochondrial isozymes VA and VB over the cytosolic and membrane-associated carbonic anhydrases I, II and IV. Bioorg Med Chem Lett18:6332-5 (2008) 
 
Carbonic anhydrase 2
Name:Carbonic anhydrase 2
Type:Enzyme
Mol. Mass.:29250.71
Organism:Homo sapiens (Human)
Description:P00918
Residue:260
BDBM50256567
NameBDBM50256567
Synonyms:CHEMBL482149 | N-[5-(4-bromophenyl)-1,3,4-thiadiazol-2-yl]sulfamide
TypeSmall organic molecule
Emp. Form.C8H7BrN4O2S2
Mol. Mass.335.201
SMILESNS(=O)(=O)Nc1nnc(s1)-c1ccc(Br)cc1