Reaction Details
TargetEpidermal growth factor receptor
LigandBDBM5445
Substrate/Competitorn/a
Meas. Tech.ChEMBL_515202 (CHEMBL1028080)
IC50 11±n/a nM
Citation Rheault, TRCaferro, TRDickerson, SHDonaldson, KHGaul, MDGoetz, ASMullin, RJMcDonald, OBPetrov, KGRusnak, DWShewchuk, LMSpehar, GMTruesdale, ATVanderwall, DEWood, ERUehling, DE Thienopyrimidine-based dual EGFR/ErbB-2 inhibitors. Bioorg Med Chem Lett19:817-20 (2009) 
 
Epidermal growth factor receptor
Name:Epidermal growth factor receptor
Type:Receptor Kinase Domain
Mol. Mass.:134279.59
Organism:Homo sapiens (Human)
Description:P00533
Residue:1210
BDBM5445
NameBDBM5445
Synonyms:CHEMBL554 LAPATINIB DITOSYLATE N-{3-chloro-4-[(3-fluoro-benzyl)oxy]phenyl}-6-[5-({2-(methylsulfonyl)ethyl]amino}methyl)-2-furyl]-4-quinazolinamine Tykerb US10822334, Compound Lapatinib cid_208908
TypeSmall organic molecule
Emp. Form.C29H26ClFN4O4S
Mol. Mass.581.058
SMILESCS(=O)(=O)CCNCc1ccc(o1)-c1ccc2ncnc(Nc3ccc(OCc4cccc(F)c4)c(Cl)c3)c2c1