Reaction Details
TargetHistone acetyltransferase KAT5
LigandBDBM50255522
Substrate/Competitorn/a
Meas. Tech.ChEMBL_515391 (CHEMBL1025546)
IC50 79620±n/a nM
Citation Wu, JXie, NWu, ZZhang, YZheng, YG Bisubstrate Inhibitors of the MYST HATs Esa1 and Tip60. Bioorg Med Chem17:1381-6 (2009) 
 
Histone acetyltransferase KAT5
Name:Histone acetyltransferase KAT5
Type:PROTEIN
Mol. Mass.:58595.98
Organism:Homo sapiens (Human)
Description:ChEMBL_796787
Residue:513
BDBM50255522
NameBDBM50255522
Synonyms:Ac-ARTKQTARKSTGGK(CoA)APRKQL | CHEMBL526343
TypeSmall organic molecule
Emp. Form.C116H205N42O45P3S
Mol. Mass.3033.11
SMILES[#6]-[#6](-[#6])-[#6]-[#6@H](-[#7]-[#6](=O)-[#6@H](-[#6]-[#6]-[#6](-[#7])=O)-[#7]-[#6](=O)-[#6@H](-[#6]-[#6]-[#6]-[#6]-[#7])-[#7]-[#6](=O)-[#6@H](-[#6]-[#6]-[#6]\[#7]=[#6](/[#7])-[#7])-[#7]-[#6](=O)-[#6@@H]-1-[#6]-[#6]-[#6]-[#7]-1-[#6](=O)-[#6@H](-[#6])-[#7]-[#6](=O)-[#6@H](-[#6]-[#6]-[#6]-[#6]-[#7]-[#6](=O)-[#6]-[#16]-[#6]-[#6]-[#7]-[#6](=O)-[#6]-[#6]-[#7]-[#6](=O)-[#6@H](-[#8])C([#6])([#6])[#6]-[#8]P([#8])(=O)[#8]P([#8])(=O)[#8]-[#6]-[#6@H]-1-[#8]-[#6@H](-[#6@H](-[#8])-[#6@@H]-1-[#8]P([#8])([#8])=O)-n1cnc2c(-[#7])ncnc12)-[#7]-[#6](=O)-[#6]-[#7]-[#6](=O)-[#6]-[#7]-[#6](=O)-[#6@@H](-[#7]-[#6](=O)-[#6@H](-[#6]-[#8])-[#7]-[#6](=O)-[#6@H](-[#6]-[#6]-[#6]-[#6]-[#7])-[#7]-[#6](=O)-[#6@H](-[#6]-[#6]-[#6]\[#7]=[#6](/[#7])-[#7])-[#7]-[#6](=O)-[#6@H](-[#6])-[#7]-[#6](=O)-[#6@@H](-[#7]-[#6](=O)-[#6@H](-[#6]-[#6]-[#6](-[#7])=O)-[#7]-[#6](=O)-[#6@H](-[#6]-[#6]-[#6]-[#6]-[#7])-[#7]-[#6](=O)-[#6@@H](-[#7]-[#6](=O)-[#6@H](-[#6]-[#6]-[#6]\[#7]=[#6](/[#7])-[#7])-[#7]-[#6](=O)-[#6@H](-[#6])-[#7]-[#6](-[#6])=O)-[#6@@H](-[#6])-[#8])-[#6@@H](-[#6])-[#8])-[#6@@H](-[#6])-[#8])-[#6](-[#8])=O