Reaction Details
TargetHistone acetyltransferase KAT5
LigandBDBM50367033
Substrate/Competitorn/a
Meas. Tech.ChEMBL_515391 (CHEMBL1025546)
IC50 82270±n/a nM
Citation Wu, JXie, NWu, ZZhang, YZheng, YG Bisubstrate Inhibitors of the MYST HATs Esa1 and Tip60. Bioorg Med Chem17:1381-6 (2009) 
 
Histone acetyltransferase KAT5
Name:Histone acetyltransferase KAT5
Type:PROTEIN
Mol. Mass.:58595.98
Organism:Homo sapiens (Human)
Description:ChEMBL_796787
Residue:513
BDBM50367033
NameBDBM50367033
Synonyms:COENZYME_A
TypeSmall organic molecule
Emp. Form.C21H36N7O16P3S
Mol. Mass.767.534
SMILESCC(C)(CO[P@@](O)(=O)O[P@](O)(=O)OC[C@H]1O[C@H]([C@H](O)[C@@H]1OP(O)(O)=O)n1cnc2c(N)ncnc12)[C@@H](O)C(=O)NCCC(=O)NCCS