Reaction Details
TargetCarbonic anhydrase
LigandBDBM10875
Substrate/Competitorn/a
Meas. Tech.ChEMBL_515851 (CHEMBL993110)
Ki 565±n/a nM
Citation Isik, SKockar, FAydin, MArslan, OGuler, OOInnocenti, AScozzafava, ASupuran, CT Carbonic anhydrase inhibitors: inhibition of the beta-class enzyme from the yeast Saccharomyces cerevisiae with sulfonamides and sulfamates. Bioorg Med Chem17:1158-63 (2009) 
 
Carbonic anhydrase
Name:Carbonic anhydrase
Type:PROTEIN
Mol. Mass.:24861.97
Organism:Saccharomyces cerevisiae
Description:ChEMBL_1507033
Residue:221
BDBM10875
NameBDBM10875
Synonyms:5-(2-chlorophenyl)-1,3,4-thiadiazole-2-sulfonamide Chlorzolamide, CHL JMC523116 Compound 19 | aromatic/heteroaromatic sulfonamide 20
TypeSmall organic molecule
Emp. Form.C8H6ClN3O2S2
Mol. Mass.275.735
SMILESNS(=O)(=O)c1nnc(s1)-c1ccccc1Cl