Reaction Details
TargetCarbonic anhydrase 1
LigandBDBM10871
Substrate/Competitorn/a
Meas. Tech.ChEMBL_515849 (CHEMBL993108)
Ki 164±n/a nM
Citation Isik, SKockar, FAydin, MArslan, OGuler, OOInnocenti, AScozzafava, ASupuran, CT Carbonic anhydrase inhibitors: inhibition of the beta-class enzyme from the yeast Saccharomyces cerevisiae with sulfonamides and sulfamates. Bioorg Med Chem17:1158-63 (2009) 
 
Carbonic anhydrase 1
Name:Carbonic anhydrase 1
Type:Enzyme
Mol. Mass.:28873.37
Organism:Homo sapiens (Human)
Description:P00915
Residue:261
BDBM10871
NameBDBM10871
Synonyms:4-amino-N-[(4-sulfamoylphenyl)methyl]benzene-1-sulfonamide aromatic/heteroaromatic sulfonamide 16
TypeSmall organic molecule
Emp. Form.C13H15N3O4S2
Mol. Mass.341.406
SMILESNc1ccc(cc1)S(=O)(=O)NCc1ccc(cc1)S(N)(=O)=O