Reaction Details
TargetCarbonic anhydrase 2
LigandBDBM29277
Substrate/Competitorn/a
Meas. Tech.ChEMBL_515850 (CHEMBL993109)
Ki 495±n/a nM
Citation Isik, SKockar, FAydin, MArslan, OGuler, OOInnocenti, AScozzafava, ASupuran, CT Carbonic anhydrase inhibitors: inhibition of the beta-class enzyme from the yeast Saccharomyces cerevisiae with sulfonamides and sulfamates. Bioorg Med Chem17:1158-63 (2009) 
 
Carbonic anhydrase 2
Name:Carbonic anhydrase 2
Type:Enzyme
Mol. Mass.:29250.71
Organism:Homo sapiens (Human)
Description:P00918
Residue:260
BDBM29277
NameBDBM29277
Synonyms:CHEMBL451332 | sulfonamide, 3
TypeSmall organic molecule
Emp. Form.C9H11NO4S
Mol. Mass.229.253
SMILESNS(=O)(=O)c1ccc(CCC(O)=O)cc1