Reaction Details
TargetCarbonic anhydrase 2
LigandBDBM10876
Substrate/Competitorn/a
Meas. Tech.ChEMBL_515850 (CHEMBL993109)
Ki 80±n/a nM
Citation Isik, SKockar, FAydin, MArslan, OGuler, OOInnocenti, AScozzafava, ASupuran, CT Carbonic anhydrase inhibitors: inhibition of the beta-class enzyme from the yeast Saccharomyces cerevisiae with sulfonamides and sulfamates. Bioorg Med Chem17:1158-63 (2009) 
 
Carbonic anhydrase 2
Name:Carbonic anhydrase 2
Type:Enzyme
Mol. Mass.:29250.71
Organism:Homo sapiens (Human)
Description:P00918
Residue:260
BDBM10876
NameBDBM10876
Synonyms:4-(hydroxymethyl)benzene-1-sulfonamide JMC522226 Compound 20 aromatic/heteroaromatic sulfonamide 21
TypeSmall organic molecule
Emp. Form.C7H9NO3S
Mol. Mass.187.216
SMILESNS(=O)(=O)c1ccc(CO)cc1