Reaction Details
TargetKappa-type opioid receptor
LigandBDBM50255956
Substrate/Competitorn/a
Meas. Tech.ChEMBL_515868 (CHEMBL993922)
EC50 1578±n/a nM
Citation Hayashi, SHirao, AImai, ANakamura, HMurata, YOhashi, KNakata, E Novel non-peptide nociceptin/orphanin FQ receptor agonist, 1-[1-(1-Methylcyclooctyl)-4-piperidinyl]-2-[(3R)-3-piperidinyl]-1H-benzimidazole: design, synthesis, and structure-activity relationship of oral receptor occupancy in the brain for orally potent antianxiety drug. J Med Chem52:610-25 (2009) 
 
Kappa-type opioid receptor
Name:Kappa-type opioid receptor
Type:G Protein-Coupled Receptor (GPCR)
Mol. Mass.:42648.76
Organism:Homo sapiens (Human)
Description:P41145
Residue:380
BDBM50255956
NameBDBM50255956
Synonyms:1-[1-(1-Methylcyclooctyl)piperidin-4-yl]-2-[3-(trifluoromethyl)phenyl]-1H-benzimidazole | CHEMBL519100
TypeSmall organic molecule
Emp. Form.C28H34F3N3
Mol. Mass.469.5849
SMILESCC1(CCCCCCC1)N1CCC(CC1)n1c(nc2ccccc12)-c1cccc(c1)C(F)(F)F