Reaction Details
TargetKappa-type opioid receptor
LigandBDBM50255135
Substrate/Competitorn/a
Meas. Tech.ChEMBL_515864 (CHEMBL993918)
Ki 72±n/a nM
Citation Hayashi, SHirao, AImai, ANakamura, HMurata, YOhashi, KNakata, E Novel non-peptide nociceptin/orphanin FQ receptor agonist, 1-[1-(1-Methylcyclooctyl)-4-piperidinyl]-2-[(3R)-3-piperidinyl]-1H-benzimidazole: design, synthesis, and structure-activity relationship of oral receptor occupancy in the brain for orally potent antianxiety drug. J Med Chem52:610-25 (2009) 
 
Kappa-type opioid receptor
Name:Kappa-type opioid receptor
Type:G Protein-Coupled Receptor (GPCR)
Mol. Mass.:42648.76
Organism:Homo sapiens (Human)
Description:P41145
Residue:380
BDBM50255135
NameBDBM50255135
Synonyms:1-(3-{1-[1-(1-Methylcyclooctyl)piperidin-4-yl]-1H-benzimidazol-2-yl}phenyl)methanamine | CHEMBL480426
TypeSmall organic molecule
Emp. Form.C28H38N4
Mol. Mass.430.6281
SMILESCC1(CCCCCCC1)N1CCC(CC1)n1c(nc2ccccc12)-c1cccc(CN)c1