Reaction Details
TargetMu-type opioid receptor
LigandBDBM50255900
Substrate/Competitorn/a
Meas. Tech.ChEMBL_515867 (CHEMBL993921)
EC50 71±n/a nM
Citation Hayashi, SHirao, AImai, ANakamura, HMurata, YOhashi, KNakata, E Novel non-peptide nociceptin/orphanin FQ receptor agonist, 1-[1-(1-Methylcyclooctyl)-4-piperidinyl]-2-[(3R)-3-piperidinyl]-1H-benzimidazole: design, synthesis, and structure-activity relationship of oral receptor occupancy in the brain for orally potent antianxiety drug. J Med Chem52:610-25 (2009) 
 
Mu-type opioid receptor
Name:Mu-type opioid receptor
Type:G Protein-Coupled Receptor (GPCR)
Mol. Mass.:44789.51
Organism:Homo sapiens (Human)
Description:P35372
Residue:400
BDBM50255900
NameBDBM50255900
Synonyms:1-[1-(1-Methylcyclooctyl)-4-piperidinyl]-2-[(3S)-1-methyl-3-piperidinyl]-1H-benzimidazole | CHEMBL501331
TypeSmall organic molecule
Emp. Form.C27H42N4
Mol. Mass.422.6492
SMILESCN1CCC[C@@H](C1)c1nc2ccccc2n1C1CCN(CC1)C1(C)CCCCCCC1