Reaction Details
TargetNociceptin receptor
LigandBDBM50255899
Substrate/Competitorn/a
Meas. Tech.ChEMBL_515862 (CHEMBL993121)
Ki 0.100000±n/a nM
Citation Hayashi, SHirao, AImai, ANakamura, HMurata, YOhashi, KNakata, E Novel non-peptide nociceptin/orphanin FQ receptor agonist, 1-[1-(1-Methylcyclooctyl)-4-piperidinyl]-2-[(3R)-3-piperidinyl]-1H-benzimidazole: design, synthesis, and structure-activity relationship of oral receptor occupancy in the brain for orally potent antianxiety drug. J Med Chem52:610-25 (2009) 
 
Nociceptin receptor
Name:Nociceptin receptor
Type:G Protein-Coupled Receptor (GPCR)
Mol. Mass.:40702.87
Organism:Homo sapiens (Human)
Description:P41146
Residue:370
BDBM50255899
NameBDBM50255899
Synonyms:1-[1-(1-Methylcyclooctyl)-4-piperidinyl]-2-[(3S)-3-piperidinyl]-1H-benzimidazole | CHEMBL481366
TypeSmall organic molecule
Emp. Form.C26H40N4
Mol. Mass.408.6226
SMILESCC1(CCCCCCC1)N1CCC(CC1)n1c(nc2ccccc12)[C@H]1CCCNC1