Reaction Details
TargetNociceptin receptor
LigandBDBM50255901
Substrate/Competitorn/a
Meas. Tech.ChEMBL_515862 (CHEMBL993121)
Ki 0.150000±n/a nM
Citation Hayashi, SHirao, AImai, ANakamura, HMurata, YOhashi, KNakata, E Novel non-peptide nociceptin/orphanin FQ receptor agonist, 1-[1-(1-Methylcyclooctyl)-4-piperidinyl]-2-[(3R)-3-piperidinyl]-1H-benzimidazole: design, synthesis, and structure-activity relationship of oral receptor occupancy in the brain for orally potent antianxiety drug. J Med Chem52:610-25 (2009) 
 
Nociceptin receptor
Name:Nociceptin receptor
Type:G Protein-Coupled Receptor (GPCR)
Mol. Mass.:40702.87
Organism:Homo sapiens (Human)
Description:P41146
Residue:370
BDBM50255901
NameBDBM50255901
Synonyms:1-[1-(1-Methylcyclooctyl)piperidin-4-yl]-2-[3-(methylsulfonyl)phenyl]-1H-benzimidazole | CHEMBL481367
TypeSmall organic molecule
Emp. Form.C28H37N3O2S
Mol. Mass.479.677
SMILESCC1(CCCCCCC1)N1CCC(CC1)n1c(nc2ccccc12)-c1cccc(c1)S(C)(=O)=O