Reaction Details
TargetKappa-type opioid receptor
LigandBDBM50255136
Substrate/Competitorn/a
Meas. Tech.ChEMBL_515868 (CHEMBL993922)
EC50 18±n/a nM
Citation Hayashi, SHirao, AImai, ANakamura, HMurata, YOhashi, KNakata, E Novel non-peptide nociceptin/orphanin FQ receptor agonist, 1-[1-(1-Methylcyclooctyl)-4-piperidinyl]-2-[(3R)-3-piperidinyl]-1H-benzimidazole: design, synthesis, and structure-activity relationship of oral receptor occupancy in the brain for orally potent antianxiety drug. J Med Chem52:610-25 (2009) 
 
Kappa-type opioid receptor
Name:Kappa-type opioid receptor
Type:G Protein-Coupled Receptor (GPCR)
Mol. Mass.:42648.76
Organism:Homo sapiens (Human)
Description:P41145
Residue:380
BDBM50255136
NameBDBM50255136
Synonyms:2-(3,5-dimethylpiperazin-1-yl)-1-[1-(1-methylcyclooctyl)piperidin-4-yl]-1H-benzimidazole | CHEMBL519925
TypeSmall organic molecule
Emp. Form.C27H43N5
Mol. Mass.437.6638
SMILESCC1CN(CC(C)N1)c1nc2ccccc2n1C1CCN(CC1)C1(C)CCCCCCC1