Reaction Details
TargetMatrix metalloproteinase-9
LigandBDBM50163748
Substrate/Competitorn/a
Meas. Tech.ChEMBL_516050 (CHEMBL982420)
IC50 19400±n/a nM
Citation Claramunt, RMBouissane, LCabildo, MPCornago, MPElguero, JRadziwon, AMedina, C Synthesis and biological evaluation of curcuminoid pyrazoles as new therapeutic agents in inflammatory bowel disease: effect on matrix metalloproteinases. Bioorg Med Chem17:1290-6 (2009) 
 
Matrix metalloproteinase-9
Name:Matrix metalloproteinase-9
Type:Enzyme
Mol. Mass.:78452.28
Organism:Homo sapiens (Human)
Description:P14780
Residue:707
BDBM50163748
NameBDBM50163748
Synonyms:(E)-3,5-Bis[beta-(4-Hydroxy-3-methoxyphenyl)-ethenyl]-1H-pyrazole 4,40-(1E,10E)-2,20-(1-H-Pyrazole-3,5-diyl)bis(ethene-2,1-diyl)bis(2-methoxyphenol) 4-(2-(5-(4-hydroxy-3-methoxystyryl)-1H-pyrazol-3-yl)vinyl)-2-methoxyphenol | CHEMBL180239
TypeSmall organic molecule
Emp. Form.C21H20N2O4
Mol. Mass.364.3945
SMILESCOc1cc(\C=C\c2cc(\C=C\c3ccc(O)c(OC)c3)[nH]n2)ccc1O