Reaction Details
TargetTranslocator protein
LigandBDBM50185957
Substrate/Competitorn/a
Meas. Tech.ChEMBL_516175 (CHEMBL984215)
Ki 0.92±n/a nM
Citation Scarf, AMIttner, LMKassiou, M The translocator protein (18 kDa): central nervous system disease and drug design. J Med Chem52:581-92 (2009) 
 
Translocator protein
Name:Translocator protein
Type:Mitochondrion membrane protein
Mol. Mass.:18945.84
Organism:Rattus norvegicus (rat)
Description:Competitive binding experiments were performed on rat kidney mitochondrial membranes.
Residue:169
BDBM50185957
NameBDBM50185957
Synonyms:CHEMBL205767 N-(4-chloro-2-phenoxyphenyl)-N-(2-isopropoxybenzyl)acetamide
TypeSmall organic molecule
Emp. Form.C24H24ClNO3
Mol. Mass.409.905
SMILESCC(C)Oc1ccccc1CN(C(C)=O)c1ccc(Cl)cc1Oc1ccccc1