Reaction Details
TargetTranslocator protein
LigandBDBM22040
Substrate/Competitorn/a
Meas. Tech.ChEMBL_516174 (CHEMBL984214)
Kd 1.1±n/a nM
Citation Scarf, AMIttner, LMKassiou, M The translocator protein (18 kDa): central nervous system disease and drug design. J Med Chem52:581-92 (2009) 
 
Translocator protein
Name:Translocator protein
Type:Mitochondrion membrane protein
Mol. Mass.:18945.84
Organism:Rattus norvegicus (rat)
Description:Competitive binding experiments were performed on rat kidney mitochondrial membranes.
Residue:169
BDBM22040
NameBDBM22040
Synonyms:4 -chlorodiazepam 7-chloro-5-(4-chlorophenyl)-1-methyl-1,3-dihydro-2H-1,4-benzodiazepin-2-one CHEMBL286346 Ro-05-4864 Ro5-4864
TypeSmall organic molecule
Emp. Form.C16H12Cl2N2O
Mol. Mass.319.185
SMILESCN1c2ccc(Cl)cc2C(=NCC1=O)c1ccc(Cl)cc1