Reaction Details
TargetTranslocator protein
LigandBDBM50045877
Substrate/Competitorn/a
Meas. Tech.ChEMBL_516175 (CHEMBL984215)
Ki 5±n/a nM
Citation Scarf, AMIttner, LMKassiou, M The translocator protein (18 kDa): central nervous system disease and drug design. J Med Chem52:581-92 (2009) 
 
Translocator protein
Name:Translocator protein
Type:Mitochondrion membrane protein
Mol. Mass.:18945.84
Organism:Rattus norvegicus (rat)
Description:Competitive binding experiments were performed on rat kidney mitochondrial membranes.
Residue:169
BDBM50045877
NameBDBM50045877
Synonyms:2-(2-(4-fluorophenyl)-1H-indol-3-yl)-N,N-dihexylacetamide CHEMBL63154 | [N,N-di-n-hexyl-2-(4-fluorophenyl) indole-3-acetamide]
TypeSmall organic molecule
Emp. Form.C28H37FN2O
Mol. Mass.436.6046
SMILESCCCCCCN(CCCCCC)C(=O)Cc1c([nH]c2ccccc12)-c1ccc(F)cc1