Reaction Details
TargetTrans-sialidase
LigandBDBM50266478
Substrate/Competitorn/a
Meas. Tech.ChEMBL_516607 (CHEMBL988694)
IC50 180000±n/a nM
Citation Neres, JBrewer, MLRatier, LBotti, HBuschiazzo, AEdwards, PNMortenson, PNCharlton, MHAlzari, PMFrasch, ACBryce, RADouglas, KT Discovery of novel inhibitors of Trypanosoma cruzi trans-sialidase from in silico screening. Bioorg Med Chem Lett19:589-96 (2009) 
 
Trans-sialidase
Name:Trans-sialidase
Synonyms:n/a
Type:n/a
Mol. Mass.:70598.62
Organism:Trypanosoma cruzi
Description:Q26966
Residue:642
BDBM50266478
NameBDBM50266478
Synonyms:3-(benzo[d]thiazol-2-yl)-4-(3,4-dimethoxyphenyl)but-3-enoate
TypeSmall organic molecule
Emp. Form.C19H16NO4S
Mol. Mass.354.4
SMILESCOc1ccc(\C=C(/CC([O-])=O)c2nc3ccccc3s2)cc1OC