Reaction Details
TargetRyanodine receptor 1
LigandBDBM50241985
Substrate/Competitorn/a
Meas. Tech.ChEMBL_497239 (CHEMBL1006192)
EC50>100000±n/a nM
Citation Zieminska, ELazarewicz, JWCouladouros, EAMoutsos, VIPitsinos, EN Open-chain half-bastadins mimic the effects of cyclic bastadins on calcium homeostasis in cultured neurons. Bioorg Med Chem Lett18:5734-7 (2009) 
 
Ryanodine receptor 1
Name:Ryanodine receptor 1
Type:PROTEIN
Mol. Mass.:565027.60
Organism:Homo sapiens (Human)
Description:ChEMBL_196055
Residue:5038
BDBM50241985
NameBDBM50241985
Synonyms:(E,Z)bastadin-19 CHEMBL506286 | CHEMBL508830
TypeSmall organic molecule
Emp. Form.C34H27Br5N4O8
Mol. Mass.1019.12
SMILESOc1c(Br)cc2CCNC(=O)C(Cc3cc(Br)c(O)c(Oc4c(Br)cc(CC(N=O)C(=O)NCCc5ccc(Oc1c2)c(Br)c5)cc4Br)c3)N=O