Reaction Details
TargetMitogen-activated protein kinase 14
LigandBDBM50377985
Substrate/Competitorn/a
Meas. Tech.ChEMBL_497084 (CHEMBL997720)
Ki 14±n/a nM
Citation Baldwin, IBamborough, PHaslam, CGHunjan, SSLongstaff, TMooney, CJPatel, SQuinn, JSomers, DO Kinase array design, back to front: biaryl amides. Bioorg Med Chem Lett18:5285-9 (2008) 
 
Mitogen-activated protein kinase 14
Name:Mitogen-activated protein kinase 14
Type:Serine/threonine-protein kinase
Mol. Mass.:41286.76
Organism:Homo sapiens (Human)
Description:Q16539
Residue:360
BDBM50377985
NameBDBM50377985
Synonyms:CHEMBL1964268
TypeSmall organic molecule
Emp. Form.C28H28N6O2
Mol. Mass.480.5609
SMILESCC(=O)Nc1cc(n[nH]1)-c1ccc(cc1)-c1cc(NC(=O)c2ccnc(c2)N2CCCC2)ccc1C