Reaction Details
TargetMitogen-activated protein kinase 14
LigandBDBM50264958
Substrate/Competitorn/a
Meas. Tech.ChEMBL_497084 (CHEMBL997720)
Ki 6.7±n/a nM
Citation Baldwin, IBamborough, PHaslam, CGHunjan, SSLongstaff, TMooney, CJPatel, SQuinn, JSomers, DO Kinase array design, back to front: biaryl amides. Bioorg Med Chem Lett18:5285-9 (2008) 
 
Mitogen-activated protein kinase 14
Name:Mitogen-activated protein kinase 14
Type:Serine/threonine-protein kinase
Mol. Mass.:41286.76
Organism:Homo sapiens (Human)
Description:Q16539
Residue:360
BDBM50264958
NameBDBM50264958
Synonyms:CHEMBL526452 | N-(4'-(2-aminothiazol-4-yl)-6-methylbiphenyl-3-yl)-2-(pyrrolidin-1-yl)isonicotinamide
TypeSmall organic molecule
Emp. Form.C26H25N5OS
Mol. Mass.455.575
SMILESCc1ccc(NC(=O)c2ccnc(c2)N2CCCC2)cc1-c1ccc(cc1)-c1csc(N)n1