Reaction Details
TargetMitogen-activated protein kinase 14
LigandBDBM50265034
Substrate/Competitorn/a
Meas. Tech.ChEMBL_497084 (CHEMBL997720)
Ki 2.8±n/a nM
Citation Baldwin, IBamborough, PHaslam, CGHunjan, SSLongstaff, TMooney, CJPatel, SQuinn, JSomers, DO Kinase array design, back to front: biaryl amides. Bioorg Med Chem Lett18:5285-9 (2008) 
 
Mitogen-activated protein kinase 14
Name:Mitogen-activated protein kinase 14
Type:Serine/threonine-protein kinase
Mol. Mass.:41286.76
Organism:Homo sapiens (Human)
Description:Q16539
Residue:360
BDBM50265034
NameBDBM50265034
Synonyms:2',6-dimethyl-4'-(5-methyl-1,3,4-oxadiazol-2-yl)-N-(3-morpholinophenyl)biphenyl-3-carboxamide | CHEMBL523559
TypeSmall organic molecule
Emp. Form.C28H28N4O3
Mol. Mass.468.5469
SMILESCc1nnc(o1)-c1ccc(c(C)c1)-c1cc(ccc1C)C(=O)Nc1cccc(c1)N1CCOCC1