Reaction Details
TargetMitogen-activated protein kinase 14
LigandBDBM50265112
Substrate/Competitorn/a
Meas. Tech.ChEMBL_497084 (CHEMBL997720)
Ki 11±n/a nM
Citation Baldwin, IBamborough, PHaslam, CGHunjan, SSLongstaff, TMooney, CJPatel, SQuinn, JSomers, DO Kinase array design, back to front: biaryl amides. Bioorg Med Chem Lett18:5285-9 (2008) 
 
Mitogen-activated protein kinase 14
Name:Mitogen-activated protein kinase 14
Type:Serine/threonine-protein kinase
Mol. Mass.:41286.76
Organism:Homo sapiens (Human)
Description:Q16539
Residue:360
BDBM50265112
NameBDBM50265112
Synonyms:CHEMBL496943 | N-(3-(3-butyl-2,4-dioxo-1,2,3,4-tetrahydroquinazolin-7-yl)-4-methylphenyl)-2-(pyrrolidin-1-yl)isonicotinamide
TypeSmall organic molecule
Emp. Form.C29H31N5O3
Mol. Mass.497.5881
SMILESCCCCn1c(=O)[nH]c2cc(ccc2c1=O)-c1cc(NC(=O)c2ccnc(c2)N2CCCC2)ccc1C