Reaction Details
TargetMitogen-activated protein kinase 14
LigandBDBM50265155
Substrate/Competitorn/a
Meas. Tech.ChEMBL_497084 (CHEMBL997720)
Ki 6.7±n/a nM
Citation Baldwin, IBamborough, PHaslam, CGHunjan, SSLongstaff, TMooney, CJPatel, SQuinn, JSomers, DO Kinase array design, back to front: biaryl amides. Bioorg Med Chem Lett18:5285-9 (2008) 
 
Mitogen-activated protein kinase 14
Name:Mitogen-activated protein kinase 14
Type:Serine/threonine-protein kinase
Mol. Mass.:41286.76
Organism:Homo sapiens (Human)
Description:Q16539
Residue:360
BDBM50265155
NameBDBM50265155
Synonyms:CHEMBL496528 | N-cyclopropyl-4-methyl-3-(4-oxo-2-(thiophen-2-yl)-4H-chromen-7-yl)benzamide
TypeSmall organic molecule
Emp. Form.C24H19NO3S
Mol. Mass.401.478
SMILESCc1ccc(cc1-c1ccc2c(c1)oc(cc2=O)-c1cccs1)C(=O)NC1CC1