Reaction Details
TargetMitogen-activated protein kinase 14
LigandBDBM50264756
Substrate/Competitorn/a
Meas. Tech.ChEMBL_497084 (CHEMBL997720)
Ki 0.8±n/a nM
Citation Baldwin, IBamborough, PHaslam, CGHunjan, SSLongstaff, TMooney, CJPatel, SQuinn, JSomers, DO Kinase array design, back to front: biaryl amides. Bioorg Med Chem Lett18:5285-9 (2008) 
 
Mitogen-activated protein kinase 14
Name:Mitogen-activated protein kinase 14
Type:Serine/threonine-protein kinase
Mol. Mass.:41286.76
Organism:Homo sapiens (Human)
Description:Q16539
Residue:360
BDBM50264756
NameBDBM50264756
Synonyms:CHEMBL485286 | N-(4-methyl-3-(3-(piperidin-4-yl)benzo[d]isoxazol-6-yl)phenyl)-2-(pyrrolidin-1-yl)isonicotinamide
TypeSmall organic molecule
Emp. Form.C29H31N5O2
Mol. Mass.481.5887
SMILESCc1ccc(NC(=O)c2ccnc(c2)N2CCCC2)cc1-c1ccc2c(noc2c1)C1CCNCC1