Reaction Details
TargetHistone deacetylase 6
LigandBDBM50258539
Substrate/Competitorn/a
Meas. Tech.ChEMBL_496828 (CHEMBL1008841)
IC50 10±n/a nM
Citation Pescatore, GKinzel, OAttenni, BCecchetti, OFiore, FFonsi, MRowley, MSchultz-Fademrecht, CSerafini, SSteinkühler, CJones, P Optimization of a series of potent and selective ketone histone deacetylase inhibitors. Bioorg Med Chem Lett18:5528-32 (2008) 
 
Histone deacetylase 6
Name:Histone deacetylase 6
Type:Chromatin regulator; hydrolase; repressor
Mol. Mass.:131381.51
Organism:Homo sapiens (Human)
Description:Q9UBN7
Residue:1215
BDBM50258539
NameBDBM50258539
Synonyms:(S)-1-methyl-N-(1-(5-(naphthalen-2-yl)-1H-imidazol-2-yl)-7-oxooctyl)piperidine-4-carboxamide | CHEMBL468513
TypeSmall organic molecule
Emp. Form.C28H36N4O2
Mol. Mass.460.611
SMILESCN1CCC(CC1)C(=O)N[C@@H](CCCCCC(C)=O)c1nc(c[nH]1)-c1ccc2ccccc2c1