Reaction Details
TargetHistone deacetylase 2
LigandBDBM25146
Substrate/Competitorn/a
Meas. Tech.ChEMBL_496826 (CHEMBL1008839)
IC50 110±n/a nM
Citation Pescatore, GKinzel, OAttenni, BCecchetti, OFiore, FFonsi, MRowley, MSchultz-Fademrecht, CSerafini, SSteinkühler, CJones, P Optimization of a series of potent and selective ketone histone deacetylase inhibitors. Bioorg Med Chem Lett18:5528-32 (2008) 
 
Histone deacetylase 2
Name:Histone deacetylase 2
Type:Chromatin regulator; hydrolase; repressor
Mol. Mass.:55356.54
Organism:Homo sapiens (Human)
Description:Q92769
Residue:488
BDBM25146
NameBDBM25146
Synonyms:2-(5-methoxy-2-methyl-1H-indol-3-yl)-N-[(1S)-7-oxo-1-(5-phenyl-1H-imidazol-2-yl)octyl]acetamide CHEMBL407959
TypeSmall organic molecule
Emp. Form.C29H34N4O3
Mol. Mass.486.6053
SMILESCOc1ccc2[nH]c(C)c(CC(=O)N[C@@H](CCCCCC(C)=O)c3nc(c[nH]3)-c3ccccc3)c2c1