Reaction Details
TargetHistone deacetylase 1
LigandBDBM25144
Substrate/Competitorn/a
Meas. Tech.ChEMBL_496821 (CHEMBL1008834)
IC50 55±n/a nM
Citation Pescatore, GKinzel, OAttenni, BCecchetti, OFiore, FFonsi, MRowley, MSchultz-Fademrecht, CSerafini, SSteinkühler, CJones, P Optimization of a series of potent and selective ketone histone deacetylase inhibitors. Bioorg Med Chem Lett18:5528-32 (2008) 
 
Histone deacetylase 1
Name:Histone deacetylase 1
Type:Enzyme
Mol. Mass.:55090.27
Organism:Homo sapiens (Human)
Description:Q13547
Residue:482
BDBM25144
NameBDBM25144
Synonyms:(2S)-2-[(1-methylpiperidin-2-yl)formamido]-8-oxo-N-(4-phenyl-1,3-thiazol-2-yl)nonanamide bis-amide inhibitor, 15
TypeSmall organic molecule
Emp. Form.C25H34N4O3S
Mol. Mass.470.627
SMILESCN1CCCCC1C(=O)N[C@@H](CCCCCC(C)=O)C(=O)Nc1nc(cs1)-c1ccccc1