Reaction Details
TargetHistone deacetylase 1
LigandBDBM50275332
Substrate/Competitorn/a
Meas. Tech.ChEMBL_496821 (CHEMBL1008834)
IC50 710±n/a nM
Citation Pescatore, GKinzel, OAttenni, BCecchetti, OFiore, FFonsi, MRowley, MSchultz-Fademrecht, CSerafini, SSteinkühler, CJones, P Optimization of a series of potent and selective ketone histone deacetylase inhibitors. Bioorg Med Chem Lett18:5528-32 (2008) 
 
Histone deacetylase 1
Name:Histone deacetylase 1
Type:Enzyme
Mol. Mass.:55090.27
Organism:Homo sapiens (Human)
Description:Q13547
Residue:482
BDBM50275332
NameBDBM50275332
Synonyms:1-methyl-N-((S)-7-oxo-1-(5-phenyl-1H-imidazol-2-yl)octyl)piperidine-2-carboxamide | CHEMBL486568
TypeSmall organic molecule
Emp. Form.C24H34N4O2
Mol. Mass.410.5524
SMILESCN1CCCCC1C(=O)N[C@@H](CCCCCC(C)=O)c1nc(c[nH]1)-c1ccccc1