Reaction Details
TargetHistone deacetylase 1
LigandBDBM50275335
Substrate/Competitorn/a
Meas. Tech.ChEMBL_496821 (CHEMBL1008834)
IC50 500±n/a nM
Citation Pescatore, GKinzel, OAttenni, BCecchetti, OFiore, FFonsi, MRowley, MSchultz-Fademrecht, CSerafini, SSteinkühler, CJones, P Optimization of a series of potent and selective ketone histone deacetylase inhibitors. Bioorg Med Chem Lett18:5528-32 (2008) 
 
Histone deacetylase 1
Name:Histone deacetylase 1
Type:Enzyme
Mol. Mass.:55090.27
Organism:Homo sapiens (Human)
Description:Q13547
Residue:482
BDBM50275335
NameBDBM50275335
Synonyms:(S)-2-(4-methylpiperazin-1-yl)-N-(7-oxo-1-(5-phenyl-1H-imidazol-2-yl)octyl)acetamide | CHEMBL486976
TypeSmall organic molecule
Emp. Form.C24H35N5O2
Mol. Mass.425.567
SMILESCN1CCN(CC(=O)N[C@@H](CCCCCC(C)=O)c2nc(c[nH]2)-c2ccccc2)CC1