Reaction Details
TargetCation-dependent mannose-6-phosphate receptor
LigandBDBM50275807
Substrate/Competitorn/a
Meas. Tech.ChEMBL_492874 (CHEMBL942205)
IC50 23000±n/a nM
Citation Jeanjean, AGary-Bobo, MNirdé, PLeiris, SGarcia, MMorère, A Synthesis of new sulfonate and phosphonate derivatives for cation-independent mannose 6-phosphate receptor targeting. Bioorg Med Chem Lett18:6240-3 (2008) 
 
Cation-dependent mannose-6-phosphate receptor
Name:Cation-dependent mannose-6-phosphate receptor
Type:PROTEIN
Mol. Mass.:30989.41
Organism:Homo sapiens (Human)
Description:ChEMBL_492874
Residue:277
BDBM50275807
NameBDBM50275807
Synonyms:mannose 6-phosphate
TypeSmall organic molecule
Emp. Form.C6H12O9P
Mol. Mass.259.1284
SMILESO[C@H]1O[C@H](COP(O)([O-])=O)[C@@H](O)[C@H](O)[C@@H]1O