Reaction Details
TargetHistamine H2 receptor
LigandBDBM50275983
Substrate/Competitorn/a
Meas. Tech.ChEMBL_493062 (CHEMBL953176)
EC50 120±n/a nM
Citation Ghorai, PKraus, AKeller, MGötte, CIgel, PSchneider, ESchnell, DBernhardt, GDove, SZabel, MElz, SSeifert, RBuschauer, A Acylguanidines as bioisosteres of guanidines: NG-acylated imidazolylpropylguanidines, a new class of histamine H2 receptor agonists. J Med Chem51:7193-204 (2009) 
 
Histamine H2 receptor
Name:Histamine H2 receptor
Type:G Protein-Coupled Receptor (GPCR)
Mol. Mass.:40115.31
Organism:Homo sapiens (Human)
Description:n/a
Residue:359
BDBM50275983
NameBDBM50275983
Synonyms:CHEMBL472441 | N1-[3-(1H-Imidazol-4-yl)propyl]-N2-[3-phenyl-3-(thiazol-2-yl)propanoyl]guanidine
TypeSmall organic molecule
Emp. Form.C19H22N6OS
Mol. Mass.382.483
SMILESNC(NC(=O)CC(c1nccs1)c1ccccc1)=NCCCc1cnc[nH]1