Reaction Details
TargetHistamine H2 receptor
LigandBDBM50377986
Substrate/Competitorn/a
Meas. Tech.ChEMBL_493062 (CHEMBL953176)
EC50 67±n/a nM
Citation Ghorai, PKraus, AKeller, MGötte, CIgel, PSchneider, ESchnell, DBernhardt, GDove, SZabel, MElz, SSeifert, RBuschauer, A Acylguanidines as bioisosteres of guanidines: NG-acylated imidazolylpropylguanidines, a new class of histamine H2 receptor agonists. J Med Chem51:7193-204 (2009) 
 
Histamine H2 receptor
Name:Histamine H2 receptor
Type:G Protein-Coupled Receptor (GPCR)
Mol. Mass.:40115.31
Organism:Homo sapiens (Human)
Description:n/a
Residue:359
BDBM50377986
NameBDBM50377986
Synonyms:CHEMBL483406 | UR-AK24
TypeSmall organic molecule
Emp. Form.C17H23N5O
Mol. Mass.313.3974
SMILESCC(CC(=O)NC(N)=NCCCc1cnc[nH]1)c1ccccc1