Reaction Details
TargetHistamine H1 receptor
LigandBDBM86171
Substrate/Competitorn/a
Meas. Tech.ChEMBL_493057 (CHEMBL953171)
Kd 22.39±n/a nM
Citation Ghorai, PKraus, AKeller, MGötte, CIgel, PSchneider, ESchnell, DBernhardt, GDove, SZabel, MElz, SSeifert, RBuschauer, A Acylguanidines as bioisosteres of guanidines: NG-acylated imidazolylpropylguanidines, a new class of histamine H2 receptor agonists. J Med Chem51:7193-204 (2009) 
 
Histamine H1 receptor
Name:Histamine H1 receptor
Type:G Protein-Coupled Receptor (GPCR)
Mol. Mass.:55641.53
Organism:Cavia porcellus (domestic guinea pig)
Description:Guinea pig cerebellum was used in binding assay.
Residue:488
BDBM86171
NameBDBM86171
Synonyms:Arpromidine NSC_65895
TypeSmall organic molecule
Emp. Form.C21H25FN6
Mol. Mass.380.4618
SMILESNC(NCCCc1cnc[nH]1)=NCCC(c1ccc(F)cc1)c1ccccn1