Reaction Details
TargetHistamine H1 receptor
LigandBDBM86742
Substrate/Competitorn/a
Meas. Tech.ChEMBL_493057 (CHEMBL953171)
Kd 741.31±n/a nM
Citation Ghorai, PKraus, AKeller, MGötte, CIgel, PSchneider, ESchnell, DBernhardt, GDove, SZabel, MElz, SSeifert, RBuschauer, A Acylguanidines as bioisosteres of guanidines: NG-acylated imidazolylpropylguanidines, a new class of histamine H2 receptor agonists. J Med Chem51:7193-204 (2009) 
 
Histamine H1 receptor
Name:Histamine H1 receptor
Type:G Protein-Coupled Receptor (GPCR)
Mol. Mass.:55641.53
Organism:Cavia porcellus (domestic guinea pig)
Description:Guinea pig cerebellum was used in binding assay.
Residue:488
BDBM86742
NameBDBM86742
Synonyms:UR-AK64
TypeSmall organic molecule
Emp. Form.C17H29N5O
Mol. Mass.319.4451
SMILESNC(NC(=O)CCCC1CCCCC1)=NCCCc1cnc[nH]1