Reaction Details
TargetHistamine H1 receptor
LigandBDBM50413171
Substrate/Competitorn/a
Meas. Tech.ChEMBL_493057 (CHEMBL953171)
Kd 3715.35±n/a nM
Citation Ghorai, PKraus, AKeller, MGötte, CIgel, PSchneider, ESchnell, DBernhardt, GDove, SZabel, MElz, SSeifert, RBuschauer, A Acylguanidines as bioisosteres of guanidines: NG-acylated imidazolylpropylguanidines, a new class of histamine H2 receptor agonists. J Med Chem51:7193-204 (2009) 
 
Histamine H1 receptor
Name:Histamine H1 receptor
Type:G Protein-Coupled Receptor (GPCR)
Mol. Mass.:55641.53
Organism:Cavia porcellus (domestic guinea pig)
Description:Guinea pig cerebellum was used in binding assay.
Residue:488
BDBM50413171
NameBDBM50413171
Synonyms:CHEMBL472273
TypeSmall organic molecule
Emp. Form.C21H23FN6O
Mol. Mass.394.4453
SMILESNC(NC(=O)CC(c1ccc(F)cc1)c1ccccn1)=NCCCc1cnc[nH]1