Reaction Details
TargetHistamine H1 receptor
LigandBDBM50413170
Substrate/Competitorn/a
Meas. Tech.ChEMBL_493057 (CHEMBL953171)
Kd 11220.18±n/a nM
Citation Ghorai, PKraus, AKeller, MGötte, CIgel, PSchneider, ESchnell, DBernhardt, GDove, SZabel, MElz, SSeifert, RBuschauer, A Acylguanidines as bioisosteres of guanidines: NG-acylated imidazolylpropylguanidines, a new class of histamine H2 receptor agonists. J Med Chem51:7193-204 (2009) 
 
Histamine H1 receptor
Name:Histamine H1 receptor
Type:G Protein-Coupled Receptor (GPCR)
Mol. Mass.:55641.53
Organism:Cavia porcellus (domestic guinea pig)
Description:Guinea pig cerebellum was used in binding assay.
Residue:488
BDBM50413170
NameBDBM50413170
Synonyms:CHEMBL472272
TypeSmall organic molecule
Emp. Form.C21H24N6O
Mol. Mass.376.4549
SMILESNC(NC(=O)CC(c1ccccc1)c1ccccn1)=NCCCc1cnc[nH]1