Reaction Details
TargetHistamine H1 receptor
LigandBDBM50413173
Substrate/Competitorn/a
Meas. Tech.ChEMBL_493057 (CHEMBL953171)
Kd 4265.8±n/a nM
Citation Ghorai, PKraus, AKeller, MGötte, CIgel, PSchneider, ESchnell, DBernhardt, GDove, SZabel, MElz, SSeifert, RBuschauer, A Acylguanidines as bioisosteres of guanidines: NG-acylated imidazolylpropylguanidines, a new class of histamine H2 receptor agonists. J Med Chem51:7193-204 (2009) 
 
Histamine H1 receptor
Name:Histamine H1 receptor
Type:G Protein-Coupled Receptor (GPCR)
Mol. Mass.:55641.53
Organism:Cavia porcellus (domestic guinea pig)
Description:Guinea pig cerebellum was used in binding assay.
Residue:488
BDBM50413173
NameBDBM50413173
Synonyms:CHEMBL513056
TypeSmall organic molecule
Emp. Form.C14H21N7OS
Mol. Mass.335.428
SMILESCc1nc[nH]c1CSCC(=O)NC(N)=NCCCc1cnc[nH]1